پسار مجزا
type: Concept
broader: پسار
preferred label: isolated drag @en
scope note: پسار جسم مورد نظر به‌صورت مجزا پیش ‌از آنکه در هواگَرد نصب شده باشد.

پسار
type: Concept
narrower: پسار مجزا
preferred label: drag @en