پسار فشاری
type: Concept
broader: پسار
preferred label: pressure drag @en
scope note: پسار ناشی از مجموع تمامی نیروهای واردشده بر سطح در جهت جریان هوا

پسار
type: Concept
narrower: پسار فشاری
preferred label: drag @en