پسار نیم‌رخی مؤثر
type: Concept
broader: پسار نیم‌رخی
preferred label: effective profile drag @en

پسار نیم‌رخی
type: Concept
broader: پسار
narrower: پسار نیم‌رخی مؤثر
preferred label: profile drag @en
scope note: تأثیر توأمان پسار شکلی و اصطکاک پوستی که متناسب با مربع سرعت افزایش می‌یابد و شکل و میزان همواری پیکره در آن مؤثر است.

پسار
type: Concept
narrower: پسار نیم‌رخی
preferred label: drag @en