پسار ضربه‌ای
type: Concept
broader: پسار
preferred label: shock drag @en
scope note: پسار مرتبط با امواج ضربه‌ای که همیشه موجب اُفت فشار کل (total pressure) یا فشار ایستایی (static pressure) می‌شود و معمولاً با توان چهارم سرعت یا دامنۀ فشار متناسب است.

پسار
type: Concept
narrower: پسار ضربه‌ای
preferred label: drag @en