پسار بادچرخی
type: Concept
broader: پسار
preferred label: windmilling drag @en
scope note: پسار اضافه‌ای که ملخ در حال بادچرخی تولید می‌کند.

پسار
type: Concept
narrower: پسار بادچرخی
preferred label: drag @en