قانون هوک
type: Concept
preferred label: Hooke's law @en
related: مکانیک مولکولی

مکانیک مولکولی
type: Concept
broader: مکانیک
preferred label: molecular mechanics @en
related: قانون هوک
scope note: روش تجربی محاسبۀ پویایی‌شناسی مولکولی که در آن پیوندهای میان اتم‌ها به شکل فنرهایی مطابق با قانون هوک (Hooke's law) نمایش داده می‌شود.

مکانیک
type: Concept
narrower: مکانیک مولکولی
preferred label: mechanics @en