شارش‌شناسی مولکولی
type: Concept
broader: شارش‌شناسی
preferred label: molecular rheology @en
scope note: شاخه‌ای از شارش‌شناسی که در آن ویژگی‌های شارش‌شناختی، به‌ویژه گران‌روی، برپایۀ معماری مولکولی و نیروهای مولکولی با استفاده از مبانی نظری یا شبیه‌سازی مولکولی پیش‌بینی می‌شود.

شارش‌شناسی
type: Concept
narrower: شارش‌شناسی مولکولی
preferred label: rheology @en