نیروی وان‌دروالس
type: Concept
broader: مکانیک
preferred label: Van der Waals force @en
related: شیمی‌فیزیک
scope note: نیروی ربایشی بین دو اتم یا دو مولکول که در نتیجۀ برهم‌کنش دوقطبی ـ دوقطبی به وجود می‌آید.

مکانیک
type: Concept
narrower: نیروی وان‌دروالس
preferred label: mechanics @en

شیمی‌فیزیک
type: Concept
preferred label: physical chemistry @en
related: نیروی وان‌دروالس