برسازه دندانی
type: Concept
preferred label: dental prosthesis @en
related: سازه‌‌دندان‌پزشکی

سازه‌‌دندان‌پزشکی
type: Concept
alternative label: دندان‌پزشکی برسازه‌ای
broader: دندانپزشکی
preferred label: prosthodontics @en
related: برسازه دندانی
scope note: شاخه‌ای از دندان‌پزشکی که به جانشین ‌کردن دندان‌ها و بافت‌های مجاور آنها با اندام مصنوعی می‌پردازد به‌طوری‌که راحتی و ظاهر و سلامت بیمار حفظ یا به او بازگردانده شود.

دندانپزشکی
type: Concept
narrower: سازه‌‌دندان‌پزشکی
preferred label: dentistry @en