پزشکی جنسی
type: Concept
broader: دانش پزشکی
preferred label: sexual medicine @en
scope note: مطالعه و تشخیص و درمان امور مربوط به سلامت جنسی زنان و مردان

دانش پزشکی
type: Concept
narrower: پزشکی جنسی
preferred label: medicine @en