شیشه درخشان
type: Concept
preferred label: meteoritic glass @en
related: شهاب‌سنگ

برخورد شهاب
type: Concept
preferred label: meteor impact @en
related: شهاب‌سنگ

شهاب‌سنگ
type: Concept
preferred label: meteorite @en
related: برخورد شهاب
related: شیشه درخشان
scope note: تکه‌سنگ باقی‌مانده از شهاب‌واره که پس از سوختن در جوّ به زمین رسیده باشد.