ویروس یاورنیاز
type: Concept
broader: ویروس
preferred label: satellite virus @en
scope note: ویروسی که اغلب از طریق جهش در طی تکثیر ویروس ایجاد می‌شود و فاقد عملکردهای ژن‌شناختی برای تکثیر است.

ویروس
type: Concept
narrower: ویروس یاورنیاز
preferred label: virus @en