بمباران کمانی
type: Concept
broader: بمباران
preferred label: loft bombing @en
scope note: نوعی بمباران که در آن هواپیمای حامل بمب در ارتفاع پایین به هدف نزدیک می‌شود و در هنگام بالا رفتن، بمب‌های خود را در نقطه‌ای ازپیش‌تعیین‌شده بر روی هدف می‌ریزد.

بمباران
type: Concept
narrower: بمباران کمانی
preferred label: bombing @en