پادکنش الکترونیکی عامل
type: Concept
alternative label: پادکال عامل
broader: پادکنش الکترونیکی
preferred label: active electronic countermeasures @en
scope note: به‌کارگیری اختلال الکترونیکی عامل (active electronic jamming) برای جلوگیری از استفادۀ دشمن از طیف الکترومغناطیسی یا کاهش میزان آن

پادکنش الکترونیکی
type: Concept
narrower: پادکنش الکترونیکی عامل
preferred label: electronic countermeasure @en