هواگرد نظامی
type: Concept
preferred label: military aircraft @en
related: پادکنش فروسرخ پیش‌گیرانه

پادکنش فروسرخ پیش‌گیرانه
type: Concept
broader: پادکنش فروسرخ
preferred label: pre-emptive infrared countermeasures @en
related: هواگرد نظامی
scope note: نوعی پادکنش فروسرخ در هواگَردها که در آن اختلال‌گرهای فروسرخ فعال می‌شوند و در جایی که احتمال مواجهه با موشک فروسرخ وجود داشته باشد منور فریب‌دهنده نیز پرتاب می‌شود.

پادکنش فروسرخ
type: Concept
narrower: پادکنش فروسرخ پیش‌گیرانه
preferred label: infrared countermeasures @en