سامانۀ پادکنش بیرونی
type: Concept
broader: پادکنش
preferred label: off-board countermeasures @en
scope note: نوعی سامانۀ پادکنش که با هواگَرد حمل می‌شود و در صورت خطر حملۀ مستقیم برای پرتاب آماده می‌شود.

پادکنش
type: Concept
narrower: سامانۀ پادکنش بیرونی
preferred label: countermeasures @en