موشک هدایت‌شونده
type: Concept
preferred label: missile @en
related: پادکنش پوشش پدافند موشک پرتابشی

پادکنش پوشش پدافند موشک پرتابشی
type: Concept
broader: پادکنش
preferred label: shrouding ballistic missile defence countermeasures @en
related: موشک هدایت‌شونده
scope note: نوعی پادکنش شامل فنون شناساگریزی در ارتفاع بالا برای کاهش سطحِ‌مقطع راداری کلاهک بازورودِ (re-entry) موشک یا برای پنهان‌سازی کلاهک در ابری از خاشه

پادکنش
type: Concept
narrower: پادکنش پوشش پدافند موشک پرتابشی
preferred label: countermeasures @en