موشک هدایت‌شونده
type: Concept
preferred label: missile @en
related: پادکنش مسیر پدافند موشک پرتابشی

پادکنش مسیر پدافند موشک پرتابشی
type: Concept
broader: پادکنش
preferred label: trajectory ballistic missile defence countermeasures @en
related: موشک هدایت‌شونده
scope note: نوعی پادکنش که در آن پرتاب موشک با بُرد بیشینه انجام نمی‌شود تا امکان کاهش یا افزایش مسیر حرکت وجود داشته باشد.

پادکنش
type: Concept
narrower: پادکنش مسیر پدافند موشک پرتابشی
preferred label: countermeasures @en