اصلاح جزئی
type: Concept
broader: بهینه‌سازی هواگرد
preferred label: minor modification @en
scope note: تغییر در طراحی هواگَرد به‌نحوی‌که صلاحیت پروازی و مشخصه‌های زیست‌محیطی آن تغییر نکند.

بهینه‌سازی هواگرد
type: Concept
narrower: اصلاح جزئی
preferred label: aircraft modification @en