مدوله‌سازی پهنای تپ
type: Concept
alternative label: مدوله‌سازی پهنای پالس
broader: مدوله‌سازی زمانی تپ
preferred label: pulse width modulation @en
scope note: نوعی مدوله‌سازی که در آن نشانک/ سیگنال مدوله‌ساز، پهنای تَپ/ پالس را تغییر می‌دهد.

مدوله‌سازی زمانی تپ
type: Concept
narrower: مدوله‌سازی پهنای تپ
preferred label: pulse time modulation @en