مدوله‌سازی تربیعی دامنه
type: Concept
broader: مدوله‌سازی
preferred label: quadrature amplitude modulation @en
scope note: روشی برای کدبندی داده‌ها در مودم‌های پرسرعت که آمیزه‌ای است از مدوله‌سازی دامنه و مدوله‌سازی فاز برای افزایش سرعت انتقال داده‌ها

مدوله‌سازی
type: Concept
narrower: مدوله‌سازی تربیعی دامنه
preferred label: modulation @en