پایشگری ابر
type: Concept
broader: پایشگری
preferred label: cloud monitoring @en
scope note: فرایند آگاه شدن از وضعیت برنامه‌های کاربردی و زیرساخت اَبر که معمولاً مجموعه‌داده‌هایی ناهم‌بسته از آن به دست می‌آید.

پایشگری
type: Concept
narrower: پایشگری ابر
preferred label: monitoring (computer) @en