جهش‌زایی جهت‌دار
type: Concept
broader: جهش‌زایی
preferred label: site-directed mutagenesis @en
scope note: هرگونه جهش‌زایی مهندسی‌شده برای تغییر مولکول‌های دِنای هدف

جهش‌زایی
type: Concept
narrower: جهش‌زایی جهت‌دار
preferred label: mutagenesis @en