زیست‌شناسی سامانه‌ها
type: Concept
alternative label: زیست‌شناسی سامانه‌ای
broader: زیست‌شناسی
preferred label: systems biology @en
scope note: گرایشی در علوم زیستی که در آن به بررسی سازمان و برهم‌کنش‌های پویای اجزا و عناصر منفرد سامانه‌های زیستی می‌پردازند.

زیست‌شناسی
type: Concept
narrower: زیست‌شناسی سامانه‌ها
preferred label: biology @en