شیمی میزبان ـ مهمان
type: Concept
broader: شیمی
preferred label: host-guest chemistry @en
scope note: شیمی مولکول‌هایی با طراحی خاص که به‌عنوان میزبان مولکول‌های دیگر عمل می‌کنند.

شیمی
type: Concept
narrower: شیمی میزبان ـ مهمان
preferred label: chemistry @en