بلورشیمی
type: Concept
broader: شیمی‌فیزیک
preferred label: crystal chemistry @en
scope note: علم بررسی روابط میان ترکیبات شیمیایی و ساختار درونی و خواص فیزیکی مواد بلورین

شیمی‌فیزیک
type: Concept
narrower: بلورشیمی
preferred label: physical chemistry @en