ناوبری شبکه‌ای
type: Concept
broader: ناوبری
preferred label: grid navigation @en
scope note: نوعی ناوبری در مناطق قطبی که در آن از مختصات خطوط شبکه‌بندی‌شده به جای طول و عرض جغرافیایی که عملاً دیگر کارایی ندارند استفاده می‌کنند.

ناوبری
type: Concept
narrower: ناوبری شبکه‌ای
preferred label: navigation @en