مخاطرات ناوبری
type: Concept
broader: ناوبری
preferred label: navigation risks @en
scope note: خطراتی که ممکن است برای یک شناور در هنگام ناوبری در دریا به وجود آید.

ناوبری
type: Concept
narrower: مخاطرات ناوبری
preferred label: navigation @en