پوش‌رنگ
type: Concept
narrower: پوش‌رنگ لعابی
preferred label: paint @en

پوش‌رنگ لعابی
type: Concept
broader: پوش‌رنگ
preferred label: enamel paint @en
scope note: مادۀ پوششی رنگ‌دانه‌دار و بر پایۀ پیوندۀ بسپاری که فیلم (film) حاصل از آن شبیه پوشش‌های معدنی است.