روسازی انعطاف‌پذیر
type: Concept
broader: روسازی
preferred label: flexible pavement @en
scope note: هر نوع روسازی که در لایه‌های سازندۀ آن بتن به کار نرفته باشد.

روسازی
type: Concept
narrower: روسازی انعطاف‌پذیر
preferred label: pavement @en