تصویرسنجی نیمه‌تحلیلی
type: Concept
broader: تصویرسنجی
preferred label: semi-analytical photogrammetry @en
scope note: روشی در تصویرسنجی که در آن از دستگاه‌های قیاسی ارتقایافته و مجهز به ابزارهای رایانه‌ای استفاده می‌شود.

تصویرسنجی
type: Concept
narrower: تصویرسنجی نیمه‌تحلیلی
preferred label: photogrammetry @en