رهبندی کاواک
type: Concept
broader: رهبندی الکتریکی
preferred label: cavity impedance @en
scope note: رهبندی در فاصلۀ میان کاتد و آند در یک لامپ ریزموج

رهبندی الکتریکی
type: Concept
narrower: رهبندی کاواک
preferred label: electric impedance @en