رهبندی آزاد
type: Concept
broader: رهبندی ورودی
preferred label: free impedance @en
scope note: رهبندی ورودی یک تراگذار وقتی که رهبندی بار خروجی آن صفر باشد.

رهبندی ورودی
type: Concept
narrower: رهبندی آزاد
preferred label: input impedance @en