رهبندی منفی
type: Concept
broader: رهبندی الکتریکی
preferred label: negative impedance @en
scope note: نوعی رهبندی که با افزایش جریان اُفت ولتاژ دو سر آن کاهش می‌یابد.

رهبندی الکتریکی
type: Concept
narrower: رهبندی منفی
preferred label: electric impedance @en