آلاینده معیار
type: Concept
broader: آلاینده
preferred label: criteria pollutant @en
related: شاخص استاندارد آلودگی هوا
scope note: هریک از آلاینده‌های عمده‌ای که در استانداردهای ملی و احیاناً بین‌المللیِ هوا برای سلامتی انسان مضر تلقی می‌شود.

آلاینده
type: Concept
narrower: آلاینده معیار
preferred label: pollutant @en

شاخص استاندارد آلودگی هوا
type: Concept
preferred label: pollutant standard index @en
related: آلاینده معیار