منبع نانقطه‌ای
type: Concept
broader: منبع آلودگی
preferred label: non-point source @en
scope note: آلودگی از یک منطقۀ گسترده و نه از نقطه‌ای معین

منبع آلودگی
type: Concept
narrower: منبع نانقطه‌ای
preferred label: pollution source @en