منبع ثابت
type: Concept
broader: منبع آلودگی
preferred label: stationary source @en
scope note: ساختمان یا سازه یا تأسیساتی که در هوا آلاینده منتشر می‌کند یا ممکن است منتشر کند.

منبع آلودگی
type: Concept
narrower: منبع ثابت
preferred label: pollution source @en