ریخته‌گری کوبشی
type: Concept
broader: ریخته‌گری
preferred label: squeeze casting @en
scope note: فرایند ریخته‌گری قطعات در قالب‌های دائمی، معمولاً فلزی، که در آن مذاب سریعاً تحت فشار مستقیم قرار می‌گیرد.

ریخته‌گری
type: Concept
narrower: ریخته‌گری کوبشی
preferred label: casting @en