پتک‌‌کاری وزنی
type: Concept
broader: پتک‌‌کاری
preferred label: drop forging @en
scope note: نوعی پتک‌‌کاری که با سقوط پتک انجام می‌شود.

پتک‌‌کاری
type: Concept
narrower: پتک‌‌کاری وزنی
preferred label: forging @en