پتک‌‌کاری پرسی
type: Concept
broader: پتک‌‌کاری
preferred label: press forging @en
scope note: تغییر شکل مومسان فلز در پرس، عموماً تحت فشار ناگهانی و یک‌مرحله‌ای

پتک‌‌کاری
type: Concept
narrower: پتک‌‌کاری پرسی
preferred label: forging @en