نزداحسگر
type: Concept
preferred label: proximity sensor @en
related: نزداحسگری

نزداحسگری
type: Concept
preferred label: proximity sensing @en
related: نزداحسگر
scope note: فنّ تشخیص حضور یا عدم حضور یک شیء با استفاده از فاصلۀ بحرانی