خالص‌سازی نهایی
type: Concept
broader: خالص‌سازی
preferred label: fine purification @en
scope note: حذف دقیق و نهایی ترکیبات نامطلوب و آلاینده به‌نحوی‌که کمترین مقدار ممکن از آنها در مادۀ خالص‌شده باقی بماند.

خالص‌سازی
type: Concept
narrower: خالص‌سازی نهایی
preferred label: purification @en