واپاشی آلفازا
type: Concept
alternative label: فروپاشی آلفازا
broader: واپاشى پرتوزا
preferred label: alpha decay @en
scope note: نوعی واپاشی خودبه‌خودی هسته‌های پرتوزا که در آن ذرۀ آلفا از هستۀ مادر گسیل می‌شود.

واپاشى پرتوزا
type: Concept
narrower: واپاشی آلفازا
preferred label: radioactive decay @en