هم‌شنوی نامفهوم
type: Concept
broader: هم‌شنوی
preferred label: unintelligible cross-talk @en
scope note: نوعی هم‌شنوی که براثر تداخل نشانک‌ها/ سیگنال‌های نامفهوم، اما گیج‌کننده از یک خط به خط دیگر ایجاد می‌شود و آزاردهنده است.

هم‌شنوی
type: Concept
narrower: هم‌شنوی نامفهوم
preferred label: crosstalk @en