طیف‌شناسی چرخشی
type: Concept
broader: طیف‌شناسی مولکولی
preferred label: rotational spectroscopy @en
scope note: مطالعۀ تغییرات در انرژی چرخشی مولکول‌ها در فاز گازی

طیف‌شناسی مولکولی
type: Concept
narrower: طیف‌شناسی چرخشی
preferred label: molecular spectroscopy @en