طیف‌شناسی ارتعاشی
type: Concept
broader: طیف‌شناسی مولکولی
preferred label: vibrational spectroscopy @en
scope note: نوعی طیف‌شناسی که در آن ارتعاشات مولکولی را باتوجه‌به تغییر گشتاورهای دوقطبی الکتریکی تعیین می‌کنند.

طیف‌شناسی مولکولی
type: Concept
narrower: طیف‌شناسی ارتعاشی
preferred label: molecular spectroscopy @en