طیف‌شناسی نورصوتی
type: Concept
broader: طیف‌شناسی نوری
preferred label: photoacoustic spectroscopy @en

طیف‌شناسی نوری
type: Concept
broader: طیف‌شناسی
narrower: طیف‌شناسی نورصوتی
preferred label: optical spectroscopy @en
scope note: ایجاد و اندازه‌گیری و تفسیر طیف‌های نوری تابشی ناشی از گسیل یا جذب انرژی تابشی به‌وسیلۀ مواد گوناگون

طیف‌شناسی
type: Concept
narrower: طیف‌شناسی نوری
preferred label: spectroscopy @en