اندود ایستابرقی
type: Concept
preferred label: electrostatic coating @en
related: افشانش ایستابرقی

افشانش ایستابرقی
type: Concept
alternative label: افشانش الکترواستاتیکی
broader: افشانش
preferred label: electrostatic spraying @en
related: اندود ایستابرقی
scope note: رنگ زدن با استفاده از دستگاهی که در آن قطرات یا ذرات بسیار ریز رنگ به‌صورت باردار بر سطح قطعۀ دارای بار مخالف پاشیده و به‌خوبی جذب می‌شوند.

افشانش
type: Concept
narrower: افشانش ایستابرقی
preferred label: spraying @en