راه‌آهن
type: Concept
preferred label: railroad @en
related: ریل استاندارد

ریل استاندارد
type: Concept
broader: استاندارد
preferred label: standard rail @en
related: راه‌آهن
scope note: ریلی که طول هر شاخۀ آن معادل یکی از معیارهای پذیرفته‌شدۀ جهانی باشد.

استاندارد
type: Concept
narrower: ریل استاندارد
preferred label: standard @en