دیوار پشت‌بنددار
type: Concept
broader: دیوار (بخش سازه‌ای)
preferred label: buttressed wall @en
scope note: دیواری که برای افزایش پایداری جانبی پشت‌بند داشته باشد.

دیوار (بخش سازه‌ای)
type: Concept
narrower: دیوار پشت‌بنددار
preferred label: wall (structural partition) @en